Demonstration: API-endpoint usage and multi-components

1 job for 278-filters in 5 minutes and 14 seconds (queued for 1 second)
Status Job ID Name Coverage
failed #2617


Name Stage Failure
make_test Test
npm ERR! 
npm ERR! Failed at the grouprise@ lint script.
npm ERR! This is probably not a problem with npm. There is likely additional logging output above.

npm ERR! A complete log of this run can be found in:
npm ERR! /root/.npm/_logs/2019-08-19T07_45_09_621Z-debug.log
make.d/ recipe for target 'lint_js' failed
make: *** [lint_js] Error 1
ERROR: Job failed: exit code 1