Add rest_api package, refs #661

1 job for 661-api-package in 5 minutes (queued for 2 seconds)
Status Job ID Name Coverage
failed #2601


Name Stage Failure
make_test Test
npm ERR! 
npm ERR! Failed at the grouprise@ lint script.
npm ERR! This is probably not a problem with npm. There is likely additional logging output above.

npm ERR! A complete log of this run can be found in:
npm ERR! /root/.npm/_logs/2019-08-12T07_35_32_980Z-debug.log
make: *** [lint_js] Error 1
make.d/ recipe for target 'lint_js' failed
ERROR: Job failed: exit code 1