Demonstration: API-endpoint usage and multi-components

1 job for 278-filters in 5 minutes and 42 seconds (queued for 2 seconds)
Status Job ID Name Coverage
  Test
failed #2598
make_test

00:05:42

 
Name Stage Failure
failed
make_test Test
npm ERR! 
npm ERR! Failed at the grouprise@ lint script.
npm ERR! This is probably not a problem with npm. There is likely additional logging output above.

npm ERR! A complete log of this run can be found in:
npm ERR! /root/.npm/_logs/2019-08-08T14_45_43_675Z-debug.log
make: *** [lint_js] Error 1
make.d/test.mk:11: recipe for target 'lint_js' failed
ERROR: Job failed: exit code 1