Bump version: 2.4.0 -> 2.4.1

2 jobs for v2.4.1 in 1 minute and 40 seconds (queued for 3 minutes and 29 seconds)
latest
Status Job ID Name Coverage
  Test
failed #1806
make_test

00:01:40

 
  Deploy
skipped #1807
make_deb_package
 
Name Stage Failure
failed
make_test Test
env -i PATH="$PATH:$(dirname "build/node/bin/node")" node "build/node/bin/npm" ci --no-progress
npm ERR! code E404
npm ERR! 404 Not Found: har-validator@5.1.2

npm ERR! A complete log of this run can be found in:
npm ERR! /root/.npm/_logs/2019-01-18T10_40_16_055Z-debug.log
make.d/assets.mk:25: recipe for target 'node_modules' failed
make: *** [node_modules] Error 1
ERROR: Job failed: exit code 1